Reaction Details
TargetGlycogen synthase kinase-3 beta
LigandBDBM50362879
Substrate/Competitorn/a
Meas. Tech.ChEMBL_798627 (CHEMBL1942616)
IC50 36±n/a nM
Citation Seto, SYumoto, KOkada, KAsahina, YIwane, AIwago, MTerasawa, RShreder, KRMurakami, KKohno, Y Quinolone derivatives containing strained spirocycle as orally active glycogen synthase kinase 3ß (GSK-3ß) inhibitors for type 2 diabetics. Bioorg Med Chem20:1188-200 (2012) 
 
Glycogen synthase kinase-3 beta
Name:Glycogen synthase kinase-3 beta
Type:Enzyme
Mol. Mass.:46756.38
Organism:Homo sapiens (Human)
Description:P49841
Residue:420
BDBM50362879
NameBDBM50362879
Synonyms:CHEMBL1940905
TypeSmall organic molecule
Emp. Form.C23H24FN5O4
Mol. Mass.453.4662
SMILESNc1c(F)c(NCCNc2ccccn2)c2OCCC3(CCC3)n3cc(C(O)=O)c(=O)c1c23