Reaction Details
TargetAldo-keto reductase family 1 member B1
LigandBDBM23410
Substrate/Competitorn/a
Meas. Tech.ChEMBL_797273 (CHEMBL1942674)
IC50 2700±n/a nM
Citation Naeem, SHylands, PBarlow, D Construction of an Indonesian herbal constituents database and its use in Random Forest modelling in a search for inhibitors of aldose reductase. Bioorg Med Chem20:1251-8 (2012) 
 
Aldo-keto reductase family 1 member B1
Name:Aldo-keto reductase family 1 member B1
Type:Protein
Mol. Mass.:35855.50
Organism:Homo sapiens (Human)
Description:P15121. 4LAU; 2IKI; 4LB4; 2FZD; 2FZ8; 1US0
Residue:316
BDBM23410
NameBDBM23410
Synonyms:2-(3,4-dihydroxyphenyl)-3,5-dihydroxy-7-methoxy-4H-chromen-4-one Rhamnetin
Typeflavonol
Emp. Form.C16H12O7
Mol. Mass.316.2623
SMILESCOc1cc(O)c2c(c1)oc(-c1ccc(O)c(O)c1)c(O)c2=O