Reaction Details
TargetAldo-keto reductase family 1 member B1
LigandBDBM50362888
Substrate/Competitorn/a
Meas. Tech.ChEMBL_797273 (CHEMBL1942674)
IC50 560±n/a nM
Citation Naeem, SHylands, PBarlow, D Construction of an Indonesian herbal constituents database and its use in Random Forest modelling in a search for inhibitors of aldose reductase. Bioorg Med Chem20:1251-8 (2012) 
 
Aldo-keto reductase family 1 member B1
Name:Aldo-keto reductase family 1 member B1
Type:Protein
Mol. Mass.:35855.50
Organism:Homo sapiens (Human)
Description:P15121. 4LAU; 2IKI; 4LB4; 2FZD; 2FZ8; 1US0
Residue:316
BDBM50362888
NameBDBM50362888
Synonyms:CHEMBL1940910
TypeSmall organic molecule
Emp. Form.C26H30O13
Mol. Mass.550.5086
SMILESOC[C@H]1O[C@@H](Oc2ccc(C(=O)\C=C\c3ccc(O)cc3)c(O)c2)[C@H](O[C@@H]2OC[C@](O)(CO)[C@H]2O)[C@@H](O)[C@@H]1O