Reaction Details
TargetAldo-keto reductase family 1 member B1
LigandBDBM83922
Substrate/Competitorn/a
Meas. Tech.ChEMBL_797273 (CHEMBL1942674)
IC50 8690±n/a nM
Citation Naeem, SHylands, PBarlow, D Construction of an Indonesian herbal constituents database and its use in Random Forest modelling in a search for inhibitors of aldose reductase. Bioorg Med Chem20:1251-8 (2012) 
 
Aldo-keto reductase family 1 member B1
Name:Aldo-keto reductase family 1 member B1
Type:Protein
Mol. Mass.:35855.50
Organism:Homo sapiens (Human)
Description:P15121. 4LAU; 2IKI; 4LB4; 2FZD; 2FZ8; 1US0
Residue:316
BDBM83922
NameBDBM83922
Synonyms:1,6,6-trimethyl-8,9-dihydro-7H-naphtho[1,2-g][1]benzofuran-10,11-dione 1,6,6-trimethyl-8,9-dihydro-7H-naphtho[1,2-g]benzofuran-10,11-quinone SMR000387068 cid_164676 | med.21724, Compound 173
TypeSmall organic molecule
Emp. Form.C19H18O3
Mol. Mass.294.3444
SMILESCc1coc-2c1C(=O)C(=O)c1c3CCCC(C)(C)c3ccc-21