Reaction Details
TargetTumor susceptibility gene 101 protein
LigandBDBM50362891
Substrate/Competitorn/a
Meas. Tech.ChEMBL_800317 (CHEMBL1948067)
Ki 2700±n/a nM
Citation Kim, SELiu, FIm, YJStephen, AGFivash, MJWaheed, AAFreed, EOFisher, RJHurley, JHBurke, TR Elucidation of New Binding Interactions with the Tumor Susceptibility Gene 101 (Tsg101) Protein Using Modified HIV-1 Gag-p6 Derived Peptide Ligands. ACS Med Chem Lett2:337-341 (2011) 
 
Tumor susceptibility gene 101 protein
Name:Tumor susceptibility gene 101 protein
Type:PROTEIN
Mol. Mass.:43943.30
Organism:Homo sapiens (Human)
Description:ChEMBL_800321
Residue:390
BDBM50362891
NameBDBM50362891
Synonyms:CHEMBL1946260
TypeSmall organic molecule
Emp. Form.C59H75N11O22
Mol. Mass.1290.2873
SMILESC[C@@H](O)[C@H](NC(=O)[C@@H]1C[C@H](CN1C(=O)[C@H](CCC(O)=O)NC(=O)[C@@H]1CCCN1C(C)=O)O\N=C\c1ccc(OC(=O)c2ccc3OCOc3c2)cc1)C(=O)N[C@@H](C)C(=O)N1CCC[C@H]1C(=O)N1CCC[C@H]1C(=O)N[C@@H](CCC(O)=O)C(=O)N[C@@H](CCC(O)=O)C(N)=O