Reaction Details
TargetRiboflavin-binding protein
LigandBDBM50362897
Substrate/Competitorn/a
Meas. Tech.ChEMBL_800332 (CHEMBL1948178)
pH7.4±n/a
Kd 61±n/a nM
Commentsextracted
Citation Plantinga, AWitte, ALi, MHHarmon, AChoi, SKBanaszak Holl, MMOrr, BGBaker, JRSinniah, K Bioanalytical Screening of Riboflavin Antagonists for Targeted Drug Delivery - A Thermodynamic and Kinetic Study. ACS Med Chem Lett2:363-367 (2011) 
 
Riboflavin-binding protein
Name:Riboflavin-binding protein
Type:PROTEIN
Mol. Mass.:27203.20
Organism:Gallus gallus
Description:ChEMBL_800332
Residue:238
BDBM50362897
NameBDBM50362897
Synonyms:LUMIFLAVIN
TypeSmall organic molecule
Emp. Form.C13H12N4O2
Mol. Mass.256.26
SMILESCc1cc2nc3c(nc(=O)[nH]c3=O)n(C)c2cc1C