Reaction Details
TargetPeroxisome proliferator-activated receptor gamma
LigandBDBM50362950
Substrate/Competitorn/a
Meas. Tech.ChEMBL_801285 (CHEMBL1947834)
EC50 1±n/a nM
Citation Liu, WLau, FLiu, KWood, HBZhou, GChen, YLi, YAkiyama, TECastriota, GEinstein, MWang, CMcCann, MEDoebber, TWWu, MChang, CHMcNamara, LMcKeever, BMosley, RTBerger, JPMeinke, PT Benzimidazolones: a new class of selective peroxisome proliferator-activated receptor¿ (PPAR¿) modulators. J Med Chem54:8541-54 (2011) 
 
Peroxisome proliferator-activated receptor gamma
Name:Peroxisome proliferator-activated receptor gamma
Type:Nuclear Receptor
Mol. Mass.:57613.46
Organism:Homo sapiens (Human)
Description:P37231
Residue:505
BDBM50362950
NameBDBM50362950
Synonyms:CHEMBL1946409
TypeSmall organic molecule
Emp. Form.C21H21F3N2O5
Mol. Mass.438.397
SMILESCN(CCOc1ccc(C[C@H](OCC(F)(F)F)C(O)=O)cc1)c1nc2ccccc2o1