Reaction Details
TargetFibroblast growth factor receptor 1
LigandBDBM50362983
Substrate/Competitorn/a
Meas. Tech.ChEMBL_800417 (CHEMBL1948348)
IC50 200±n/a nM
Citation Duffey, MOVos, TJAdams, RAlley, JAnthony, JBarrett, CBharathan, IBowman, DBump, NJChau, RCullis, CDriscoll, DLElder, AForsyth, NFrazer, JGuo, JGuo, LHyer, MLJanowick, DKulkarni, BLai, SJLasky, KLi, GLi, JLiao, DLittle, JPeng, BQian, MGReynolds, DJRezaei, MScott, MPSells, TBShinde, VShi, QJSintchak, MDSoucy, FSprott, KTStroud, SGNestor, MVisiers, IWeatherhead, GYe, YD'Amore, N Discovery of a potent and orally bioavailable benzolactam-derived inhibitor of Polo-like kinase 1 (MLN0905). J Med Chem55:197-208 (2012) 
 
Fibroblast growth factor receptor 1
Name:Fibroblast growth factor receptor 1
Type:Receptor
Mol. Mass.:91861.70
Organism:Homo sapiens (Human)
Description:P11362
Residue:822
BDBM50362983
NameBDBM50362983
Synonyms:CHEMBL1945804
TypeSmall organic molecule
Emp. Form.C23H25ClN6S
Mol. Mass.453.003
SMILESCN(C)CCCc1cnc(C)c(Nc2ncc3CC(=S)Nc4cc(Cl)ccc4-c3n2)c1