Reaction Details
TargetFibroblast growth factor receptor 1
LigandBDBM50362976
Substrate/Competitorn/a
Meas. Tech.ChEMBL_800417 (CHEMBL1948348)
IC50 11±n/a nM
Citation Duffey, MOVos, TJAdams, RAlley, JAnthony, JBarrett, CBharathan, IBowman, DBump, NJChau, RCullis, CDriscoll, DLElder, AForsyth, NFrazer, JGuo, JGuo, LHyer, MLJanowick, DKulkarni, BLai, SJLasky, KLi, GLi, JLiao, DLittle, JPeng, BQian, MGReynolds, DJRezaei, MScott, MPSells, TBShinde, VShi, QJSintchak, MDSoucy, FSprott, KTStroud, SGNestor, MVisiers, IWeatherhead, GYe, YD'Amore, N Discovery of a potent and orally bioavailable benzolactam-derived inhibitor of Polo-like kinase 1 (MLN0905). J Med Chem55:197-208 (2012) 
 
Fibroblast growth factor receptor 1
Name:Fibroblast growth factor receptor 1
Type:Receptor
Mol. Mass.:91861.70
Organism:Homo sapiens (Human)
Description:P11362
Residue:822
BDBM50362976
NameBDBM50362976
Synonyms:CHEMBL1945803
TypeSmall organic molecule
Emp. Form.C22H23ClN6S
Mol. Mass.438.976
SMILESCN(C)CCCc1cncc(Nc2ncc3CC(=S)Nc4cc(Cl)ccc4-c3n2)c1