Reaction Details
TargetPlatelet-derived growth factor receptor beta
LigandBDBM50362986
Substrate/Competitorn/a
Meas. Tech.ChEMBL_800415 (CHEMBL1948346)
IC50 23±n/a nM
Citation Duffey, MOVos, TJAdams, RAlley, JAnthony, JBarrett, CBharathan, IBowman, DBump, NJChau, RCullis, CDriscoll, DLElder, AForsyth, NFrazer, JGuo, JGuo, LHyer, MLJanowick, DKulkarni, BLai, SJLasky, KLi, GLi, JLiao, DLittle, JPeng, BQian, MGReynolds, DJRezaei, MScott, MPSells, TBShinde, VShi, QJSintchak, MDSoucy, FSprott, KTStroud, SGNestor, MVisiers, IWeatherhead, GYe, YD'Amore, N Discovery of a potent and orally bioavailable benzolactam-derived inhibitor of Polo-like kinase 1 (MLN0905). J Med Chem55:197-208 (2012) 
 
Platelet-derived growth factor receptor beta
Name:Platelet-derived growth factor receptor beta
Type:Enzyme
Mol. Mass.:123922.25
Organism:Homo sapiens (Human)
Description:P09619
Residue:1106
BDBM50362986
NameBDBM50362986
Synonyms:CHEMBL1945501
TypeSmall organic molecule
Emp. Form.C23H23ClFN5S
Mol. Mass.455.979
SMILESCN(C)CCCc1cc(Nc2ncc3CC(=S)Nc4cc(Cl)ccc4-c3n2)ccc1F