Reaction Details
TargetATP-binding cassette sub-family C member 8
LigandBDBM50362989
Substrate/Competitorn/a
Meas. Tech.ChEMBL_800636 (CHEMBL1947668)
IC50>50000±n/a nM
Citation de Tullio, PServais, ACFillet, MGillotin, FSomers, FChiap, PLebrun, PPirotte, B Hydroxylated analogues of ATP-sensitive potassium channel openers belonging to the group of 6- and/or 7-substituted 3-isopropylamino-4H-1,2,4-benzothiadiazine 1,1-dioxides: toward an improvement in sulfonylurea receptor 1 selectivity and metabolism stability. J Med Chem54:8353-61 (2011) 
 
ATP-binding cassette sub-family C member 8
Name:ATP-binding cassette sub-family C member 8
Type:PROTEIN
Mol. Mass.:177210.63
Organism:Rattus norvegicus
Description:ChEMBL_800636
Residue:1582
BDBM50362989
NameBDBM50362989
Synonyms:CHEMBL1945806
TypeSmall organic molecule
Emp. Form.C10H12ClN3O3S
Mol. Mass.289.739
SMILESCC(O)CNC1=Nc2ccc(Cl)cc2S(=O)(=O)N1