Reaction Details
TargetAldo-keto reductase family 1 member B10
LigandBDBM50363057
Substrate/Competitorn/a
Meas. Tech.ChEMBL_800765 (CHEMBL1948101)
IC50 280±n/a nM
Citation Minehira, DTakeda, DUrata, HKato, AAdachi, IWang, XMatsuya, YSugimoto, KTakemura, MEndo, SMatsunaga, THara, AKoseki, JNarukawa, KHirono, SToyooka, N Design, synthesis, and biological evaluation of novel (1-thioxo-1,2,3,4-tetrahydro-ß-carbolin-9-yl)acetic acids as selective inhibitors for AKR1B1. Bioorg Med Chem20:356-67 (2011) 
 
Aldo-keto reductase family 1 member B10
Name:Aldo-keto reductase family 1 member B10
Type:Protein
Mol. Mass.:36024.67
Organism:Homo sapiens (Human)
Description:O60218. 1ZUA; 4JII; 4GQ0
Residue:316
BDBM50363057
NameBDBM50363057
Synonyms:CHEMBL1946962
TypeSmall organic molecule
Emp. Form.C20H15BrF2N2O2S
Mol. Mass.465.311
SMILESOC(=O)Cn1c2c(CCN(Cc3ccc(Br)cc3F)C2=S)c2cc(F)ccc12