Reaction Details
TargetTYR_PHOSPHATASE_2 domain-containing protein
LigandBDBM50363159
Substrate/Competitorn/a
Meas. Tech.ChEMBL_801147 (CHEMBL1948974)
IC50 417000±n/a nM
Citation Chiaradia, LDMartins, PGCordeiro, MNGuido, RVEcco, GAndricopulo, ADYunes, RAVernal, JNunes, RJTerenzi, H Synthesis, biological evaluation, and molecular modeling of chalcone derivatives as potent inhibitors of Mycobacterium tuberculosis protein tyrosine phosphatases (PtpA and PtpB). J Med Chem55:390-402 (2012) 
 
TYR_PHOSPHATASE_2 domain-containing protein
Name:TYR_PHOSPHATASE_2 domain-containing protein
Type:Hydrolase
Mol. Mass.:30152.45
Organism:Mycobacterium tuberculosis
Description:n/a
Residue:276
BDBM50363159
NameBDBM50363159
Synonyms:CHEMBL1946001
TypeSmall organic molecule
Emp. Form.C19H12Cl2O
Mol. Mass.327.204
SMILESClc1ccc(\C=C\C(=O)c2ccc3ccccc3c2)c(Cl)c1