Reaction Details
TargetTYR_PHOSPHATASE_2 domain-containing protein
LigandBDBM50363136
Substrate/Competitorn/a
Meas. Tech.ChEMBL_801152 (CHEMBL1948979)
Ki 13000±n/a nM
Citation Chiaradia, LDMartins, PGCordeiro, MNGuido, RVEcco, GAndricopulo, ADYunes, RAVernal, JNunes, RJTerenzi, H Synthesis, biological evaluation, and molecular modeling of chalcone derivatives as potent inhibitors of Mycobacterium tuberculosis protein tyrosine phosphatases (PtpA and PtpB). J Med Chem55:390-402 (2012) 
 
TYR_PHOSPHATASE_2 domain-containing protein
Name:TYR_PHOSPHATASE_2 domain-containing protein
Type:Hydrolase
Mol. Mass.:30152.45
Organism:Mycobacterium tuberculosis
Description:n/a
Residue:276
BDBM50363136
NameBDBM50363136
Synonyms:CHEMBL455453
TypeSmall organic molecule
Emp. Form.C16H11NO5
Mol. Mass.297.2622
SMILES[O-][N+](=O)c1ccc(cc1)C(=O)\C=C\c1ccc2OCOc2c1