Reaction Details
TargetAdenosine receptor A3
LigandBDBM50293031
Substrate/Competitorn/a
Meas. Tech.ChEMBL_800443 (CHEMBL1948464)
Ki 1±n/a nM
Citation Hou, XMajik, MSKim, KPyee, YLee, YAlexander, VChung, HJLee, HWChandra, GLee, JHPark, SGChoi, WJKim, HOPhan, KGao, ZGJacobson, KAChoi, SLee, SKJeong, LS Structure-activity relationships of truncated C2- or C8-substituted adenosine derivatives as dual acting A2A and A3 adenosine receptor ligands. J Med Chem55:342-56 (2012) 
 
Adenosine receptor A3
Name:Adenosine receptor A3
Type:G Protein-Coupled Receptor (GPCR)
Mol. Mass.:36197.32
Organism:Homo sapiens (Human)
Description:P0DMS8
Residue:318
BDBM50293031
NameBDBM50293031
Synonyms:2-chloro-N6-(3-iodobenzyl)-5'-N-methylcarbamoyladenosine CHEMBL515442
TypeSmall organic molecule
Emp. Form.C19H20ClIN6O5
Mol. Mass.574.757
SMILESCNC(=O)OC[C@H]1O[C@H]([C@H](O)[C@@H]1O)n1cnc2c(NCc3cccc(I)c3)nc(Cl)nc12