Reaction Details
TargetCyclin-A2/Cyclin-dependent kinase 2
LigandBDBM50363197
Substrate/Competitorn/a
Meas. Tech.ChEMBL_800519 (CHEMBL1947380)
IC50 8±n/a nM
Citation William, ADLee, ACGoh, KCBlanchard, SPoulsen, ATeo, ELNagaraj, HLee, CPWang, HWilliams, MSun, ETHu, CJayaraman, RPasha, MKEthirajulu, KWood, JMDymock, BW Discovery of kinase spectrum selective macrocycle (16E)-14-methyl-20-oxa-5,7,14,26-tetraazatetracyclo[19.3.1.1(2,6).1(8,12)]heptacosa-1(25),2(26),3,5,8(27),9,11,16,21,23-decaene (SB1317/TG02), a potent inhibitor of cyclin dependent kinases (CDKs), Janus kinase 2 (JAK2), and fms-like tyrosine kinase J Med Chem55:169-96 (2012) 
 
Cyclin-A2/Cyclin-dependent kinase 2
Name:Cyclin-A2/Cyclin-dependent kinase 2
Type:Protein Complex
Mol. Mass.:n/a
Description:Cdk2/Cyclin A kinase was purified from insect cells coinfected with Cyclin A/Cdk2 baculovirus.
Components:This complex has 2 components.
Component 1
Name:Cyclin-dependent kinase 2
Synonyms:CDK2 CDK2_HUMAN Cell division protein kinase 2 Protein cereblon/Cyclin-dependent kinase 2 | p33 protein kinase
Type:Enzyme Subunit
Mol. Mass.:33938.17
Organism:Homo sapiens (Human)
Description:P24941
Residue:298
Component 2
Name:Cyclin-A2
Synonyms:CCN1 CCNA1 CCNA2_HUMAN Cyclin-A
Type:Enzyme Subunit
Mol. Mass.:48550.19
Organism:Homo sapiens (Human)
Description:P20248
Residue:432
BDBM50363197
NameBDBM50363197
Synonyms:CHEMBL1946005
TypeSmall organic molecule
Emp. Form.C25H24F3N5O2
Mol. Mass.483.4856
SMILESCN1C\C=C\CCOc2cccc(c2)-c2ccnc(Nc3cc(C1)cc(NC(=O)C(F)(F)F)c3)n2