Reaction Details
TargetNitric oxide synthase, brain
LigandBDBM50363270
Substrate/Competitorn/a
Meas. Tech.ChEMBL_800847 (CHEMBL1948399)
IC50 46±n/a nM
Citation Durón, SGLindstrom, ABonnefous, CZhang, HChen, XSymons, KTSablad, MRozenkrants, NZhang, YWang, LYazdani, NShiau, AKNoble, SARix, PRao, TSHassig, CASmith, ND Heteroaromatic-aminomethyl quinolones: potent and selective iNOS inhibitors. Bioorg Med Chem Lett22:1237-41 (2012) 
 
Nitric oxide synthase, brain
Name:Nitric oxide synthase, brain
Type:Homodimer
Mol. Mass.:160985.98
Organism:Homo sapiens (Human)
Description:P29475
Residue:1434
BDBM50363270
NameBDBM50363270
Synonyms:CHEMBL1944884
TypeSmall organic molecule
Emp. Form.C22H18F2N4O
Mol. Mass.392.4013
SMILESCc1ccccc1CN(Cc1cc(=O)[nH]c2c(F)c(F)ccc12)c1cnccn1