Reaction Details
TargetNitric oxide synthase, inducible
LigandBDBM50363262
Substrate/Competitorn/a
Meas. Tech.ChEMBL_800850 (CHEMBL1948402)
IC50 5±n/a nM
Citation Durón, SGLindstrom, ABonnefous, CZhang, HChen, XSymons, KTSablad, MRozenkrants, NZhang, YWang, LYazdani, NShiau, AKNoble, SARix, PRao, TSHassig, CASmith, ND Heteroaromatic-aminomethyl quinolones: potent and selective iNOS inhibitors. Bioorg Med Chem Lett22:1237-41 (2012) 
 
Nitric oxide synthase, inducible
Name:Nitric oxide synthase, inducible
Type:Enzyme
Mol. Mass.:130595.79
Organism:Mus musculus (mouse)
Description:Recombinant enzyme overexpressed in E. coli.
Residue:1144
BDBM50363262
NameBDBM50363262
Synonyms:CHEMBL1944717
TypeSmall organic molecule
Emp. Form.C20H13ClF2N4O
Mol. Mass.398.793
SMILESFc1ccc2c(CN(c3cccc(Cl)c3)c3cnccn3)cc(=O)[nH]c2c1F