Reaction Details
TargetNitric oxide synthase, inducible
LigandBDBM50363276
Substrate/Competitorn/a
Meas. Tech.ChEMBL_800845 (CHEMBL1948397)
IC50 61±n/a nM
Citation Durón, SGLindstrom, ABonnefous, CZhang, HChen, XSymons, KTSablad, MRozenkrants, NZhang, YWang, LYazdani, NShiau, AKNoble, SARix, PRao, TSHassig, CASmith, ND Heteroaromatic-aminomethyl quinolones: potent and selective iNOS inhibitors. Bioorg Med Chem Lett22:1237-41 (2012) 
 
Nitric oxide synthase, inducible
Name:Nitric oxide synthase, inducible
Type:Homodimer
Mol. Mass.:131141.95
Organism:Homo sapiens (Human)
Description:P35228
Residue:1153
BDBM50363276
NameBDBM50363276
Synonyms:CHEMBL1945065
TypeSmall organic molecule
Emp. Form.C21H15ClF2N4O2
Mol. Mass.428.819
SMILESCOc1cc(ncn1)N(Cc1cc(=O)[nH]c2c(F)c(F)ccc12)c1cccc(Cl)c1