Reaction Details
Target5-hydroxytryptamine receptor 3A
LigandBDBM50363292
Substrate/Competitorn/a
Meas. Tech.ChEMBL_800919 (CHEMBL1948646)
Ki 1.6±n/a nM
Citation Simonin, JVernekar, SKThompson, AJHothersall, JDConnolly, CNLummis, SCLochner, M High-affinity fluorescent ligands for the 5-HT(3) receptor. Bioorg Med Chem Lett22:1151-5 (2012) 
 
5-hydroxytryptamine receptor 3A
Name:5-hydroxytryptamine receptor 3A
Type:Protein
Mol. Mass.:55283.27
Organism:Homo sapiens (Human)
Description:P46098
Residue:478
BDBM50363292
NameBDBM50363292
Synonyms:CHEMBL1945836
TypeSmall organic molecule
Emp. Form.C37H47BF2N6O3
Mol. Mass.672.615
SMILESCN1[C@H]2CCC[C@H]1CC(C2)NC(=O)c1nn(CCCC(=O)OCCCC2=C3C(C)=CC(C)=[N+]3[B-](F)(F)n3c(C)cc(C)c23)c2ccccc12