Reaction Details
Target5-hydroxytryptamine receptor 3A
LigandBDBM50363295
Substrate/Competitorn/a
Meas. Tech.ChEMBL_800919 (CHEMBL1948646)
Ki 1300±n/a nM
Citation Simonin, JVernekar, SKThompson, AJHothersall, JDConnolly, CNLummis, SCLochner, M High-affinity fluorescent ligands for the 5-HT(3) receptor. Bioorg Med Chem Lett22:1151-5 (2012) 
 
5-hydroxytryptamine receptor 3A
Name:5-hydroxytryptamine receptor 3A
Type:Protein
Mol. Mass.:55283.27
Organism:Homo sapiens (Human)
Description:P46098
Residue:478
BDBM50363295
NameBDBM50363295
Synonyms:CHEMBL1946154
TypeSmall organic molecule
Emp. Form.C38H50N6O7
Mol. Mass.702.8396
SMILESCCN(CC)c1ccc2cc(C(=O)NCCOCCOCCOc3cccc4c(nn(C)c34)C(=O)NC3C[C@@H]4CCC[C@@H](C3)N4C)c(=O)oc2c1