Reaction Details
Target5-hydroxytryptamine receptor 3A
LigandBDBM50363296
Substrate/Competitorn/a
Meas. Tech.ChEMBL_800919 (CHEMBL1948646)
Ki 208±n/a nM
Citation Simonin, JVernekar, SKThompson, AJHothersall, JDConnolly, CNLummis, SCLochner, M High-affinity fluorescent ligands for the 5-HT(3) receptor. Bioorg Med Chem Lett22:1151-5 (2012) 
 
5-hydroxytryptamine receptor 3A
Name:5-hydroxytryptamine receptor 3A
Type:Protein
Mol. Mass.:55283.27
Organism:Homo sapiens (Human)
Description:P46098
Residue:478
BDBM50363296
NameBDBM50363296
Synonyms:CHEMBL1946302
TypeSmall organic molecule
Emp. Form.C45H48N6O9S
Mol. Mass.848.962
SMILESCN1[C@H]2CCC[C@H]1CC(C2)NC(=O)c1nn(C)c2c(OCCOCCOCCNC(=S)Nc3ccc(c(c3)C(O)=O)-c3c4ccc(O)cc4oc4cc(=O)ccc34)cccc12