Reaction Details
TargetHistamine H3 receptor
LigandBDBM50363325
Substrate/Competitorn/a
Meas. Tech.ChEMBL_801097 (CHEMBL1948882)
Ki 3.7±n/a nM
Citation Tao, MAimone, LDGruner, JAMathiasen, JRHuang, ZLyons, JRaddatz, RHudkins, RL Synthesis and structure-activity relationship of 5-pyridazin-3-one phenoxypiperidines as potent, selective histamine H(3) receptor inverse agonists. Bioorg Med Chem Lett22:1073-7 (2012) 
 
Histamine H3 receptor
Name:Histamine H3 receptor
Type:G Protein-Coupled Receptor (GPCR)
Mol. Mass.:48607.98
Organism:Rattus norvegicus (rat)
Description:n/a
Residue:445
BDBM50363325
NameBDBM50363325
Synonyms:CHEMBL1945843
TypeSmall organic molecule
Emp. Form.C23H26N4O2
Mol. Mass.390.4781
SMILESC[C@@H]1CCCN1CCCOc1ccc(cc1)-c1cnn(-c2ccccn2)c(=O)c1