Reaction Details
TargetDelta-type opioid receptor
LigandBDBM50363331
Substrate/Competitorn/a
Meas. Tech.ChEMBL_801265 (CHEMBL1947328)
IC50 0.700000±n/a nM
Citation Dantzman, CLKing, MMErnst, GEWang, XMcCauley, JPAndisik, DWBrush, KBui, KHFrietze, WHoesch, VLiu, JPalmer, WESpear, NHudzik, TJWesolowski, SS 4-Piperidin-4-ylidenemethyl-benzamides asd-opioid receptor agonists for CNS indications: identifying clinical candidates. Bioorg Med Chem Lett22:1174-8 (2012) 
 
Delta-type opioid receptor
Name:Delta-type opioid receptor
Type:G Protein-Coupled Receptor (GPCR)
Mol. Mass.:40382.98
Organism:Homo sapiens (Human)
Description:Competition binding assays were carried out using membrane preparations from transfected HN9.10 cells that constitutively expressed the delta opioid receptor.
Residue:372
BDBM50363331
NameBDBM50363331
Synonyms:CHEMBL1946017
TypeSmall organic molecule
Emp. Form.C29H32FN3O
Mol. Mass.457.5823
SMILES[#6]-[#6]-[#7](-[#6]-[#6])-[#6](=O)-c1ccc(cc1)-[#6](=[#6]-1/[#6]-[#6]-[#7](-[#6]-c2ccc(F)cc2)-[#6]-[#6]-1)\c1cccnc1