Reaction Details
TargetCarbonic anhydrase 2
LigandBDBM7
Substrate/Competitorn/a
Meas. Tech.ChEMBL_801483 (CHEMBL1948410)
Ki 420±n/a nM
Citation Balaydin, HTSentürk, MMenzek, A Synthesis and carbonic anhydrase inhibitory properties of novel cyclohexanonyl bromophenol derivatives. Bioorg Med Chem Lett22:1352-7 (2012) 
 
Carbonic anhydrase 2
Name:Carbonic anhydrase 2
Type:Enzyme
Mol. Mass.:29250.71
Organism:Homo sapiens (Human)
Description:P00918
Residue:260
BDBM7
NameBDBM7
Synonyms:2-methylcyclohexan-1-one | 2-methylcyclohexanone
TypeSmall organic molecule
Emp. Form.C7H12O
Mol. Mass.112.1696
SMILESCC1CCCCC1=O