Reaction Details
TargetCarbonic anhydrase 4
LigandBDBM50363542
Substrate/Competitorn/a
Meas. Tech.ChEMBL_801534 (CHEMBL1948548)
Ki 543±n/a nM
Citation Ekinci, DCavdar, HDurdagi, STalaz, OSentürk, MSupuran, CT Structure-activity relationships for the interaction of 5,10-dihydroindeno[1,2-b]indole derivatives with human and bovine carbonic anhydrase isoforms I, II, III, IV and VI. Eur J Med Chem49:68-73 (2012) 
 
Carbonic anhydrase 4
Name:Carbonic anhydrase 4
Type:Enzyme
Mol. Mass.:35037.98
Organism:Homo sapiens (Human)
Description:P22748
Residue:312
BDBM50363542
NameBDBM50363542
Synonyms:CHEMBL596277
TypeSmall organic molecule
Emp. Form.C15H11NO2
Mol. Mass.237.2533
SMILESOc1ccc-2c(Cc3c-2[nH]c2ccccc32)c1O