Reaction Details
TargetCarbonic anhydrase 4
LigandBDBM50363543
Substrate/Competitorn/a
Meas. Tech.ChEMBL_801534 (CHEMBL1948548)
Ki 435±n/a nM
Citation Ekinci, DCavdar, HDurdagi, STalaz, OSentürk, MSupuran, CT Structure-activity relationships for the interaction of 5,10-dihydroindeno[1,2-b]indole derivatives with human and bovine carbonic anhydrase isoforms I, II, III, IV and VI. Eur J Med Chem49:68-73 (2012) 
 
Carbonic anhydrase 4
Name:Carbonic anhydrase 4
Type:Enzyme
Mol. Mass.:35037.98
Organism:Homo sapiens (Human)
Description:P22748
Residue:312
BDBM50363543
NameBDBM50363543
Synonyms:CHEMBL593507
TypeSmall organic molecule
Emp. Form.C15H11NO2
Mol. Mass.237.2533
SMILESOc1ccc(O)c-2c1Cc1c-2[nH]c2ccccc12