Reaction Details
TargetCarbonic anhydrase 3
LigandBDBM50363545
Substrate/Competitorn/a
Meas. Tech.ChEMBL_801536 (CHEMBL1948550)
Ki 4630±n/a nM
Citation Ekinci, DCavdar, HDurdagi, STalaz, OSentürk, MSupuran, CT Structure-activity relationships for the interaction of 5,10-dihydroindeno[1,2-b]indole derivatives with human and bovine carbonic anhydrase isoforms I, II, III, IV and VI. Eur J Med Chem49:68-73 (2012) 
 
Carbonic anhydrase 3
Name:Carbonic anhydrase 3
Type:Enzyme
Mol. Mass.:29376.92
Organism:Bos taurus (Cattle)
Description:Q3SZX4
Residue:260
BDBM50363545
NameBDBM50363545
Synonyms:CHEMBL607823
TypeSmall organic molecule
Emp. Form.C15H11NO2
Mol. Mass.237.2533
SMILESOc1cc2Cc3c([nH]c4ccccc34)-c2c(O)c1