Reaction Details
TargetCarbonic anhydrase 2
LigandBDBM50363542
Substrate/Competitorn/a
Meas. Tech.ChEMBL_801533 (CHEMBL1948547)
Ki 447±n/a nM
Citation Ekinci, DCavdar, HDurdagi, STalaz, OSentürk, MSupuran, CT Structure-activity relationships for the interaction of 5,10-dihydroindeno[1,2-b]indole derivatives with human and bovine carbonic anhydrase isoforms I, II, III, IV and VI. Eur J Med Chem49:68-73 (2012) 
 
Carbonic anhydrase 2
Name:Carbonic anhydrase 2
Type:Enzyme
Mol. Mass.:29250.71
Organism:Homo sapiens (Human)
Description:P00918
Residue:260
BDBM50363542
NameBDBM50363542
Synonyms:CHEMBL596277
TypeSmall organic molecule
Emp. Form.C15H11NO2
Mol. Mass.237.2533
SMILESOc1ccc-2c(Cc3c-2[nH]c2ccccc32)c1O