Reaction Details
TargetCarbonic anhydrase 2
LigandBDBM50336488
Substrate/Competitorn/a
Meas. Tech.ChEMBL_801533 (CHEMBL1948547)
Ki 500±n/a nM
Citation Ekinci, DCavdar, HDurdagi, STalaz, OSentürk, MSupuran, CT Structure-activity relationships for the interaction of 5,10-dihydroindeno[1,2-b]indole derivatives with human and bovine carbonic anhydrase isoforms I, II, III, IV and VI. Eur J Med Chem49:68-73 (2012) 
 
Carbonic anhydrase 2
Name:Carbonic anhydrase 2
Type:Enzyme
Mol. Mass.:29250.71
Organism:Homo sapiens (Human)
Description:P00918
Residue:260
BDBM50336488
NameBDBM50336488
Synonyms:1,2-dimethoxybenzene | CHEMBL1668603
TypeSmall organic molecule
Emp. Form.C8H10O2
Mol. Mass.138.1638
SMILESCOc1ccccc1OC