Reaction Details
TargetNitric oxide synthase, endothelial
LigandBDBM50363617
Substrate/Competitorn/a
Meas. Tech.ChEMBL_801785 (CHEMBL1947348)
Ki 500000±n/a nM
Citation Salerno, LModica, MNRomeo, GPittalà, VSiracusa, MAAmato, MEAcquaviva, RDi Giacomo, CSorrenti, V Novel inhibitors of nitric oxide synthase with antioxidant properties. Eur J Med Chem49:118-26 (2012) 
 
Nitric oxide synthase, endothelial
Name:Nitric oxide synthase, endothelial
Type:PROTEIN
Mol. Mass.:132922.33
Organism:Mus musculus
Description:ChEMBL_801785
Residue:1202
BDBM50363617
NameBDBM50363617
Synonyms:CHEMBL1946359
TypeSmall organic molecule
Emp. Form.C14H15N3O3
Mol. Mass.273.2872
SMILESCC(C)c1nccn1CC(=O)c1ccc(cc1)[N+]([O-])=O