Reaction Details
TargetNitric oxide synthase, endothelial
LigandBDBM50363628
Substrate/Competitorn/a
Meas. Tech.ChEMBL_801785 (CHEMBL1947348)
Ki 30000±n/a nM
Citation Salerno, LModica, MNRomeo, GPittalà, VSiracusa, MAAmato, MEAcquaviva, RDi Giacomo, CSorrenti, V Novel inhibitors of nitric oxide synthase with antioxidant properties. Eur J Med Chem49:118-26 (2012) 
 
Nitric oxide synthase, endothelial
Name:Nitric oxide synthase, endothelial
Type:PROTEIN
Mol. Mass.:132922.33
Organism:Mus musculus
Description:ChEMBL_801785
Residue:1202
BDBM50363628
NameBDBM50363628
Synonyms:CHEMBL1946207
TypeSmall organic molecule
Emp. Form.C12H11N3O3
Mol. Mass.245.234
SMILESCc1ccnn1CC(=O)c1ccc(cc1)[N+]([O-])=O