Reaction Details
TargetNitric oxide synthase, endothelial
LigandBDBM50363630
Substrate/Competitorn/a
Meas. Tech.ChEMBL_801785 (CHEMBL1947348)
Ki 25000±n/a nM
Citation Salerno, LModica, MNRomeo, GPittalà, VSiracusa, MAAmato, MEAcquaviva, RDi Giacomo, CSorrenti, V Novel inhibitors of nitric oxide synthase with antioxidant properties. Eur J Med Chem49:118-26 (2012) 
 
Nitric oxide synthase, endothelial
Name:Nitric oxide synthase, endothelial
Type:PROTEIN
Mol. Mass.:132922.33
Organism:Mus musculus
Description:ChEMBL_801785
Residue:1202
BDBM50363630
NameBDBM50363630
Synonyms:CHEMBL1946204
TypeSmall organic molecule
Emp. Form.C23H17N3O3
Mol. Mass.383.3994
SMILES[O-][N+](=O)c1ccc(cc1)C(=O)Cn1cnc(c1-c1ccccc1)-c1ccccc1