Reaction Details
TargetCarbonic anhydrase
LigandBDBM10877
Substrate/Competitorn/a
Meas. Tech.ChEMBL_801827 (CHEMBL1947439)
Ki 1380±n/a nM
Citation Ohradanova, AVullo, DPastorekova, SPastorek, JJackson, DJWörheide, GSupuran, CT Cloning, characterization and sulfonamide inhibition studies of ana-carbonic anhydrase from the living fossil sponge Astrosclera willeyana. Bioorg Med Chem20:1403-10 (2012) 
 
Carbonic anhydrase
Name:Carbonic anhydrase
Synonyms:Astrosclerin-3
Type:PROTEIN
Mol. Mass.:33233.07
Organism:Astrosclera willeyana
Description:ChEMBL_801827
Residue:292
BDBM10877
NameBDBM10877
TypeSmall organic molecule
Emp. Form.C8H11NO3S
Mol. Mass.201.243
SMILESNS(=O)(=O)c1ccc(CCO)cc1