Reaction Details
TargetEpidermal growth factor receptor
LigandBDBM3294
Substrate/Competitorn/a
Meas. Tech.ChEMBL_802194 (CHEMBL1949352)
IC50 53±n/a nM
Citation Li, SGuo, CSun, XLi, YZhao, HZhan, DLan, MTang, Y Synthesis and biological evaluation of quinazoline and quinoline bearing 2,2,6,6-tetramethylpiperidine-N-oxyl as potential epidermal growth factor receptor(EGFR) tyrosine kinase inhibitors and EPR bio-probe agents. Eur J Med Chem49:271-8 (2012) 
 
Epidermal growth factor receptor
Name:Epidermal growth factor receptor
Type:Receptor Kinase Domain
Mol. Mass.:134279.59
Organism:Homo sapiens (Human)
Description:P00533
Residue:1210
BDBM3294
NameBDBM3294
Synonyms:4-Anilinoquinazoline deriv. 45 Anilinoquinazoline, 4b | CHEMBL52765
TypeSmall organic molecule
Emp. Form.C14H11BrN4
Mol. Mass.315.168
SMILESNc1ccc2ncnc(Nc3cccc(Br)c3)c2c1