Reaction Details
TargetGlycogen phosphorylase, muscle form
LigandBDBM50363877
Substrate/Competitorn/a
Meas. Tech.ChEMBL_802298 (CHEMBL1949456)
pH6.8±n/a
Ki 4400±n/a nM
Commentsextracted
Citation Nagy, VFelföldi, NKónya, BPraly, JPDocsa, TGergely, PChrysina, EDTiraidis, CKosmopoulou, MNAlexacou, KMKonstantakaki, MLeonidas, DDZographos, SEOikonomakos, NGKozmon, STvaroška, ISomsák, L N-(4-Substituted-benzoyl)-N'-(ß-d-glucopyranosyl)ureas as inhibitors of glycogen phosphorylase: Synthesis and evaluation by kinetic, crystallographic, and molecular modelling methods. Bioorg Med Chem20:1801-16 (2012) 
 
Glycogen phosphorylase, muscle form
Name:Glycogen phosphorylase, muscle form
Type:Enzyme
Mol. Mass.:97296.32
Organism:Oryctolagus cuniculus (rabbit)
Description:Phosphorylation of Ser-15 converts phosphorylase B (unphosphorylated) to phosphorylase A.
Residue:843
BDBM50363877
NameBDBM50363877
Synonyms:CHEMBL1232636
TypeSmall organic molecule
Emp. Form.C14H17ClN2O7
Mol. Mass.360.747
SMILESOC[C@H]1O[C@@H](NC(=O)NC(=O)c2ccc(Cl)cc2)[C@H](O)[C@@H](O)[C@@H]1O