Reaction Details
TargetTransient receptor potential cation channel subfamily A member 1
LigandBDBM50363887
Substrate/Competitorn/a
Meas. Tech.ChEMBL_802299 (CHEMBL1949457)
IC50 3100±n/a nM
Citation Baraldi, PGRomagnoli, RSaponaro, GAghazadeh Tabrizi, MBaraldi, SPedretti, PFusi, CNassini, RMaterazzi, SGeppetti, PPreti, D 7-Substituted-pyrrolo[3,2-d]pyrimidine-2,4-dione derivatives as antagonists of the transient receptor potential ankyrin 1 (TRPA1) channel: a promising approach for treating pain and inflammation. Bioorg Med Chem20:1690-8 (2012) 
 
Transient receptor potential cation channel subfamily A member 1
Name:Transient receptor potential cation channel subfamily A member 1
Type:Protein
Mol. Mass.:127514.20
Organism:Homo sapiens (Human)
Description:O75762
Residue:1119
BDBM50363887
NameBDBM50363887
Synonyms:CHEMBL1944845
TypeSmall organic molecule
Emp. Form.C20H24N4O3
Mol. Mass.368.4296
SMILESCn1c2ccn(CC(=O)Nc3ccc(cc3)C(C)(C)C)c2c(=O)n(C)c1=O