Reaction Details
TargetTransient receptor potential cation channel subfamily A member 1
LigandBDBM50363883
Substrate/Competitorn/a
Meas. Tech.ChEMBL_802299 (CHEMBL1949457)
IC50 1300±n/a nM
Citation Baraldi, PGRomagnoli, RSaponaro, GAghazadeh Tabrizi, MBaraldi, SPedretti, PFusi, CNassini, RMaterazzi, SGeppetti, PPreti, D 7-Substituted-pyrrolo[3,2-d]pyrimidine-2,4-dione derivatives as antagonists of the transient receptor potential ankyrin 1 (TRPA1) channel: a promising approach for treating pain and inflammation. Bioorg Med Chem20:1690-8 (2012) 
 
Transient receptor potential cation channel subfamily A member 1
Name:Transient receptor potential cation channel subfamily A member 1
Type:Protein
Mol. Mass.:127514.20
Organism:Homo sapiens (Human)
Description:O75762
Residue:1119
BDBM50363883
NameBDBM50363883
Synonyms:CHEMBL1946120
TypeSmall organic molecule
Emp. Form.C20H15F4N5O3S
Mol. Mass.481.423
SMILESCn1c2ccn(CC(=O)Nc3nc(cs3)-c3ccc(F)c(c3)C(F)(F)F)c2c(=O)n(C)c1=O