Reaction Details
TargetProstaglandin D2 receptor
LigandBDBM50363929
Substrate/Competitorn/a
Meas. Tech.ChEMBL_805477 (CHEMBL1955370)
IC50 21±n/a nM
Citation Liu, JLi, ARWang, YJohnson, MGSu, YShen, WWang, XLively, SBrown, MLai, SGonzalez Lopez De Turiso, FXu, QVan Lengerich, BSchmitt, MFu, ZSun, YLawlis, SSeitz, LDanao, JWait, JYe, QTang, HLGrillo, MCollins, TLSullivan, TJMedina, JC Discovery of AMG 853, a CRTH2 and DP Dual Antagonist. ACS Med Chem Lett2:326-330 (2011) 
 
Prostaglandin D2 receptor
Name:Prostaglandin D2 receptor
Type:Enzyme
Mol. Mass.:40288.87
Organism:Homo sapiens (Human)
Description:Q13258
Residue:359
BDBM50363929
NameBDBM50363929
Synonyms:CHEMBL1951556
TypeSmall organic molecule
Emp. Form.C26H26Cl2N2O7S
Mol. Mass.581.465
SMILESCCCCNC(=O)c1ccc(Oc2ccc(CC(O)=O)cc2OC)c(NS(=O)(=O)c2ccc(Cl)c(Cl)c2)c1