Reaction Details
TargetSphingosine 1-phosphate receptor 1
LigandBDBM50363937
Substrate/Competitorn/a
Meas. Tech.ChEMBL_802533 (CHEMBL1952569)
EC50 1.1±n/a nM
Citation Nishi, TMiyazaki, STakemoto, TSuzuki, KIio, YNakajima, KOhnuki, TKawase, YNara, FInaba, SIzumi, TYuita, HOshima, KDoi, HInoue, RTomisato, WKagari, TShimozato, T Discovery of CS-0777: A Potent, Selective, and Orally Active S1P1 Agonist. ACS Med Chem Lett2:368-372 (2011) 
 
Sphingosine 1-phosphate receptor 1
Name:Sphingosine 1-phosphate receptor 1
Type:Enzyme
Mol. Mass.:42836.02
Organism:Homo sapiens (Human)
Description:P21453
Residue:382
BDBM50363937
NameBDBM50363937
Synonyms:CHEMBL1951588
TypeSmall organic molecule
Emp. Form.C21H31N2O5P
Mol. Mass.422.455
SMILESCc1ccc(CCCC(=O)c2ccc(CC[C@@](C)(N)COP(O)(O)=O)n2C)cc1