Reaction Details
TargetSphingosine 1-phosphate receptor 3
LigandBDBM23165
Substrate/Competitorn/a
Meas. Tech.ChEMBL_802534 (CHEMBL1952570)
EC50 3.3±n/a nM
Citation Nishi, TMiyazaki, STakemoto, TSuzuki, KIio, YNakajima, KOhnuki, TKawase, YNara, FInaba, SIzumi, TYuita, HOshima, KDoi, HInoue, RTomisato, WKagari, TShimozato, T Discovery of CS-0777: A Potent, Selective, and Orally Active S1P1 Agonist. ACS Med Chem Lett2:368-372 (2011) 
 
Sphingosine 1-phosphate receptor 3
Name:Sphingosine 1-phosphate receptor 3
Type:G Protein-Coupled Receptor (GPCR)
Mol. Mass.:42278.13
Organism:Homo sapiens (Human)
Description:Q99500
Residue:378
BDBM23165
NameBDBM23165
Synonyms:CHEMBL366208 [(2S)-2-amino-3-hydroxy-2-[2-(4-octylphenyl)ethyl]propoxy]phosphonic acid
TypeSmall organic molecule
Emp. Form.C19H34NO5P
Mol. Mass.387.4507
SMILESCCCCCCCCc1ccc(CC[C@](N)(CO)COP(O)(O)=O)cc1