Reaction Details
TargetC-C chemokine receptor type 2
LigandBDBM50363944
Substrate/Competitorn/a
Meas. Tech.ChEMBL_802787 (CHEMBL1953521)
IC50 2.6±n/a nM
Citation Xue, CBFeng, HCao, GHuang, TGlenn, JAnand, RMeloni, DZhang, KKong, LWang, AZhang, YZheng, CXia, MChen, LTanaka, HHan, QRobinson, DJModi, DStorace, LShao, LSharief, VLi, MGalya, LGCovington, MScherle, PDiamond, SEmm, TYeleswaram, SContel, NVaddi, KNewton, RHollis, GFriedman, SMetcalf, B Discovery of INCB3284, a Potent, Selective, and Orally Bioavailable hCCR2 Antagonist. ACS Med Chem Lett2:450-454 (2011) 
 
C-C chemokine receptor type 2
Name:C-C chemokine receptor type 2
Type:Enzyme
Mol. Mass.:41932.32
Organism:Homo sapiens (Human)
Description:P41597
Residue:374
BDBM50363944
NameBDBM50363944
Synonyms:CHEMBL1951769
TypeSmall organic molecule
Emp. Form.C25H29F3N4O3
Mol. Mass.490.518
SMILESO[C@]1(CC[C@@H](CC1)N1CC[C@H](C1)NC(=O)CNC(=O)c1cccc(c1)C(F)(F)F)c1cccnc1