Reaction Details
TargetEphrin type-B receptor 3
LigandBDBM50363957
Substrate/Competitorn/a
Meas. Tech.ChEMBL_803383 (CHEMBL1952842)
IC50 1090±n/a nM
Citation McDermott, LASimcox, MHiggins, BNevins, TKolinsky, KSmith, MYang, HLi, JKChen, YKe, JMallalieu, NEgan, TKolis, SRailkar, AGerber, LLuk, KC RO4383596, an orally active KDR, FGFR, and PDGFR inhibitor: synthesis and biological evaluation. Bioorg Med Chem13:4835-41 (2005) 
 
Ephrin type-B receptor 3
Name:Ephrin type-B receptor 3
Type:Protein
Mol. Mass.:110326.17
Organism:Homo sapiens (Human)
Description:P54753
Residue:998
BDBM50363957
NameBDBM50363957
Synonyms:CHEMBL1952210
TypeSmall organic molecule
Emp. Form.C24H25N5O3
Mol. Mass.431.487
SMILESCOc1ccc(cc1)N1Cc2cnc(Nc3ccccc3)nc2N([C@@H]2CC[C@@H](O)C2)C1=O