Reaction Details
TargetD(1B) dopamine receptor
LigandBDBM50363964
Substrate/Competitorn/a
Meas. Tech.ChEMBL_803949 (CHEMBL1954780)
Ki 389±n/a nM
Citation Robaa, DEnzensperger, CEldin Abulazm, SHefnawy, MMEl-Subbagh, HIWani, TALehmann, J Chiral indolo[3,2-f][3]benzazecine-type dopamine receptor antagonists: synthesis and activity of racemic and enantiopure derivatives. J Med Chem54:7422-6 (2011) 
 
D(1B) dopamine receptor
Name:D(1B) dopamine receptor
Type:Protein
Mol. Mass.:52943.41
Organism:Homo sapiens (Human)
Description:P21918
Residue:477
BDBM50363964
NameBDBM50363964
Synonyms:CHEMBL1949726
TypeSmall organic molecule
Emp. Form.C21H24N2
Mol. Mass.304.4287
SMILESC[C@@H]1Cc2c(Cc3ccccc3CCN1C)[nH]c1ccccc21