Reaction Details
TargetD(2) dopamine receptor
LigandBDBM50363966
Substrate/Competitorn/a
Meas. Tech.ChEMBL_803946 (CHEMBL1954777)
Ki 268±n/a nM
Citation Robaa, DEnzensperger, CEldin Abulazm, SHefnawy, MMEl-Subbagh, HIWani, TALehmann, J Chiral indolo[3,2-f][3]benzazecine-type dopamine receptor antagonists: synthesis and activity of racemic and enantiopure derivatives. J Med Chem54:7422-6 (2011) 
 
D(2) dopamine receptor
Name:D(2) dopamine receptor
Type:Cell-surface receptors
Mol. Mass.:50647.10
Organism:Homo sapiens (Human)
Description:P14416
Residue:443
BDBM50363966
NameBDBM50363966
Synonyms:CHEMBL1949728
TypeSmall organic molecule
Emp. Form.C21H24N2O
Mol. Mass.320.4281
SMILESCN1CCc2ccccc2Cc2[nH]c3ccccc3c2C[C@@H]1CO