Reaction Details
TargetD(3) dopamine receptor
LigandBDBM50363965
Substrate/Competitorn/a
Meas. Tech.ChEMBL_803947 (CHEMBL1954778)
Ki>10000±n/a nM
Citation Robaa, DEnzensperger, CEldin Abulazm, SHefnawy, MMEl-Subbagh, HIWani, TALehmann, J Chiral indolo[3,2-f][3]benzazecine-type dopamine receptor antagonists: synthesis and activity of racemic and enantiopure derivatives. J Med Chem54:7422-6 (2011) 
 
D(3) dopamine receptor
Name:D(3) dopamine receptor
Type:n/a
Mol. Mass.:44243.43
Organism:Homo sapiens (Human)
Description:n/a
Residue:400
BDBM50363965
NameBDBM50363965
Synonyms:CHEMBL1949727
TypeSmall organic molecule
Emp. Form.C21H22N2O2
Mol. Mass.334.4116
SMILESCN1CCc2ccccc2Cc2[nH]c3ccccc3c2CC1C(O)=O