Reaction Details
TargetC-X-C chemokine receptor type 4
LigandBDBM50363969
Substrate/Competitorn/a
Meas. Tech.ChEMBL_803952 (CHEMBL1954783)
IC50 4±n/a nM
Citation Demmer, ODijkgraaf, ISchumacher, UMarinelli, LCosconati, SGourni, EWester, HJKessler, H Design, synthesis, and functionalization of dimeric peptides targeting chemokine receptor CXCR4. J Med Chem54:7648-62 (2011) 
 
C-X-C chemokine receptor type 4
Name:C-X-C chemokine receptor type 4
Type:Enzyme
Mol. Mass.:39754.61
Organism:Homo sapiens (Human)
Description:P61073
Residue:352
BDBM50363969
NameBDBM50363969
Synonyms:CHEMBL1949734
TypeSmall organic molecule
Emp. Form.C77H98N18O14
Mol. Mass.1499.7142
SMILES[#6]-[#7]-1-[#6@H](-[#6]-[#6]-[#6]-[#7]-[#6](=O)-[#6]-[#6]-[#6]-[#6](=O)-[#7]-[#6]-[#6]-[#6]-[#6@H]-2-[#7](-[#6])-[#6](=O)-[#6@@H](-[#6]-c3ccc(-[#8])cc3)-[#7]-[#6](=O)-[#6]-[#7]-[#6](=O)-[#6@H](-[#6]-c3ccc4ccccc4c3)-[#7]-[#6](=O)-[#6@H](-[#6]-[#6]-[#6]\[#7]=[#6](\[#7])-[#7])-[#7]-[#6]-2=O)-[#6](=O)-[#7]-[#6@@H](-[#6]-[#6]-[#6]\[#7]=[#6](\[#7])-[#7])-[#6](=O)-[#7]-[#6@@H](-[#6]-c2ccc3ccccc3c2)-[#6](=O)-[#7]-[#6]-[#6](=O)-[#7]-[#6@H](-[#6]-c2ccc(-[#8])cc2)-[#6]-1=O