Reaction Details
TargetPhosphatidylinositol 4,5-bisphosphate 3-kinase catalytic subunit alpha isoform
LigandBDBM50363990
Substrate/Competitorn/a
Meas. Tech.ChEMBL_803980 (CHEMBL1954960)
Ki 0.4±n/a nM
Citation Heffron, TPWei, BOlivero, AStaben, STTsui, VDo, SDotson, JFolkes, AJGoldsmith, PGoldsmith, RGunzner, JLesnick, JLewis, CMathieu, SNonomiya, JShuttleworth, SSutherlin, DPWan, NCWang, SWiesmann, CZhu, BY Rational design of phosphoinositide 3-kinasea inhibitors that exhibit selectivity over the phosphoinositide 3-kinaseß isoform. J Med Chem54:7815-33 (2011) 
 
Phosphatidylinositol 4,5-bisphosphate 3-kinase catalytic subunit alpha isoform
Name:Phosphatidylinositol 4,5-bisphosphate 3-kinase catalytic subunit alpha isoform
Type:Enzyme Subunit
Mol. Mass.:124294.87
Organism:Homo sapiens (Human)
Description:P42336
Residue:1068
BDBM50363990
NameBDBM50363990
Synonyms:CHEMBL1949915
TypeSmall organic molecule
Emp. Form.C21H27N7O3S2
Mol. Mass.489.614
SMILESCS(=O)(=O)N1CCC(Cc2cc3c(nc(nc3s2)-c2cnc(N)nc2)N2CCOCC2)CC1