Reaction Details
TargetPhosphatidylinositol 4,5-bisphosphate 3-kinase catalytic subunit alpha isoform
LigandBDBM50419772
Substrate/Competitorn/a
Meas. Tech.ChEMBL_803980 (CHEMBL1954960)
Ki 5±n/a nM
Citation Heffron, TPWei, BOlivero, AStaben, STTsui, VDo, SDotson, JFolkes, AJGoldsmith, PGoldsmith, RGunzner, JLesnick, JLewis, CMathieu, SNonomiya, JShuttleworth, SSutherlin, DPWan, NCWang, SWiesmann, CZhu, BY Rational design of phosphoinositide 3-kinasea inhibitors that exhibit selectivity over the phosphoinositide 3-kinaseß isoform. J Med Chem54:7815-33 (2011) 
 
Phosphatidylinositol 4,5-bisphosphate 3-kinase catalytic subunit alpha isoform
Name:Phosphatidylinositol 4,5-bisphosphate 3-kinase catalytic subunit alpha isoform
Type:Enzyme Subunit
Mol. Mass.:124294.87
Organism:Homo sapiens (Human)
Description:P42336
Residue:1068
BDBM50419772
NameBDBM50419772
Synonyms:CHEMBL1950037
TypeSmall organic molecule
Emp. Form.C28H29ClN4O4S
Mol. Mass.553.072
SMILESCNC(=O)c1ccc2-c3sc(cc3CCOc2c1)C(=O)N(C)c1ccc(cc1Cl)C(=O)N1CCN(C)CC1