Reaction Details
TargetPhosphatidylinositol 4,5-bisphosphate 3-kinase catalytic subunit beta isoform
LigandBDBM50419756
Substrate/Competitorn/a
Meas. Tech.ChEMBL_803981 (CHEMBL1954961)
Ki 41±n/a nM
Citation Heffron, TPWei, BOlivero, AStaben, STTsui, VDo, SDotson, JFolkes, AJGoldsmith, PGoldsmith, RGunzner, JLesnick, JLewis, CMathieu, SNonomiya, JShuttleworth, SSutherlin, DPWan, NCWang, SWiesmann, CZhu, BY Rational design of phosphoinositide 3-kinasea inhibitors that exhibit selectivity over the phosphoinositide 3-kinaseß isoform. J Med Chem54:7815-33 (2011) 
 
Phosphatidylinositol 4,5-bisphosphate 3-kinase catalytic subunit beta isoform
Name:Phosphatidylinositol 4,5-bisphosphate 3-kinase catalytic subunit beta isoform
Type:Enzyme Subunit
Mol. Mass.:122769.00
Organism:Homo sapiens (Human)
Description:P42338
Residue:1070
BDBM50419756
NameBDBM50419756
Synonyms:CHEMBL1949912
TypeSmall organic molecule
Emp. Form.C14H14N6OS
Mol. Mass.314.366
SMILESNc1ncc(cn1)-c1nc(N2CCOCC2)c2ccsc2n1